貌似还存在一个路径长度稍微长一点就不行了的问题,别的IDE加载代码是好的。
求分析解决
11:17:50 Verbose mode can be enabled via `-v, --verbose` option
11:17:50 CONFIGURATION: https://docs.platformio.org/page/boards/espressif32/esp32-s3-devkitc-1.html
11:17:50 PLATFORM: Espressif 32 (6.9.0) > Espressif ESP32-S3-DevKitC-1-N8 (8 MB QD, No PSRAM)
11:17:50 HARDWARE: ESP32S3 240MHz, 320KB RAM, 8MB Flash
11:17:50 DEBUG: Current (esp-builtin) On-board (esp-builtin) External (cmsis-dap, esp-bridge, esp-prog, iot-bus-jtag, jlink, minimodule, olimex-arm-usb-ocd, olimex-arm-usb-ocd-h, olimex-arm-usb-tiny-h, olimex-jtag-tiny, tumpa)
11:17:50 PACKAGES:
11:17:50 - framework-arduinoespressif32 @ 3.20016.0 (2.0.16)
11:17:50 - tool-esptoolpy @ 1.40501.0 (4.5.1)
11:17:50 - tool-mkfatfs @ 2.0.1
11:17:50 - tool-mklittlefs @ 1.203.210628 (2.3)
11:17:50 - tool-mkspiffs @ 2.230.0 (2.30)
11:17:50 - toolchain-riscv32-esp @ 8.4.0+2021r2-patch5
11:17:50 - toolchain-xtensa-esp32s3 @ 8.4.0+2021r2-patch5
11:17:50 LDF: Library Dependency Finder -> https://bit.ly/configure-pio-ldf
11:17:50 LDF Modes: Finder ~ chain, Compatibility ~ soft
11:17:50 Found 40 compatible libraries
11:17:50 Scanning dependencies...
11:17:51 Dependency Graph
11:17:51 |-- CRC16 @ 1.0.6
11:17:51 |-- DHT22 @ 1.0.6
11:17:51 |-- EEPROM @ 2.0.0
11:17:51 |-- NeoPixelBus @ 2.8.2
11:17:51 |-- PCF8574 library @ 2.3.7
11:17:51 |-- RTC @ 2.4.3
11:17:51 |-- EspSoftwareSerial @ 8.1.0
11:17:51 |-- Ticker @ 2.0.0
11:17:51 |-- WatchDog @ 1.0.1
11:17:51 |-- WiFi @ 2.0.0
11:17:51 Building in release mode
11:17:53 Compiling .pio\build\esp32-s3-devkitc-1\src\Main.cpp.o
11:17:53 Building .pio\build\esp32-s3-devkitc-1\bootloader.bin
11:17:53 Generating partitions .pio\build\esp32-s3-devkitc-1\partitions.bin
11:17:53 esptool.py v4.5.1
11:17:53 Creating esp32s3 image...
11:17:53 Merged 1 ELF section
11:17:53 Successfully created esp32s3 image.
11:17:53 Compiling .pio\build\esp32-s3-devkitc-1\lib150\CRC16\CRC16.cpp.o
11:17:53 Compiling .pio\build\esp32-s3-devkitc-1\lib9db\DHT22\DHT22.cpp.o
11:17:54 Compiling .pio\build\esp32-s3-devkitc-1\lib405\EEPROM\EEPROM.cpp.o
11:17:54 Compiling .pio\build\esp32-s3-devkitc-1\lib2d1\SPI\SPI.cpp.o
11:17:54 Compiling .pio\build\esp32-s3-devkitc-1\lib72c\I2S\I2S.cpp.o
11:17:54 Compiling .pio\build\esp32-s3-devkitc-1\lib85c\NeoPixelBus\internal\animations\NeoPixelAnimator.cpp.o
11:17:54 Compiling .pio\build\esp32-s3-devkitc-1\lib85c\NeoPixelBus\internal\colors\HsbColor.cpp.o
11:17:54 Compiling .pio\build\esp32-s3-devkitc-1\lib85c\NeoPixelBus\internal\colors\HslColor.cpp.o
11:17:54 Compiling .pio\build\esp32-s3-devkitc-1\lib85c\NeoPixelBus\internal\colors\HtmlColor.cpp.o
11:17:54 Compiling .pio\build\esp32-s3-devkitc-1\lib85c\NeoPixelBus\internal\colors\HtmlColorNameStrings.cpp.o
11:17:54 Compiling .pio\build\esp32-s3-devkitc-1\lib85c\NeoPixelBus\internal\colors\HtmlColorNames.cpp.o
11:17:57 In file included from src/Main.cpp:6:
11:17:57 lib/NeoPixelBus/src/NeoPixelBrightnessBus.h:175:29: warning: 'template<class T_COLOR_FEATURE, class T_METHOD> class NeoPixelBrightnessBus' is deprecated: Use NeoPixelBusLg instead. [-Wdeprecated-declarations]
11:17:57 class NeoPixelBusC : public NeoPixelBrightnessBus<NeoGrbFeature, NeoEsp32LcdX8Ws2812Method>{
11:17:57 ^~~~~~~~~~~~~~~~~~~~~
11:17:57 In file included from src/Main.cpp:6:
11:17:57 lib/NeoPixelBus/src/NeoPixelBrightnessBus.h:32:106: note: declared here
11:17:57 template<typename T_COLOR_FEATURE, typename T_METHOD> class [[deprecated("Use NeoPixelBusLg instead.")]] NeoPixelBrightnessBus :
11:17:57 ^~~~~~~~~~~~~~~~~~~~~
11:17:57 In file included from src/Main.cpp:6:
11:17:57 lib/NeoPixelBus/src/NeoPixelBrightnessBus.h: In constructor 'NeoPixelBusC::NeoPixelBusC(uint16_t, uint8_t)':
11:17:57 lib/NeoPixelBus/src/NeoPixelBrightnessBus.h:178:9: warning: 'template<class T_COLOR_FEATURE, class T_METHOD> class NeoPixelBrightnessBus' is deprecated: Use NeoPixelBusLg instead. [-Wdeprecated-declarations]
11:17:57 NeoPixelBrightnessBus<NeoGrbFeature, NeoEsp32LcdX8Ws2812Method>(countPixels, pin)
11:17:57 ^~~~~~~~~~~~~~~~~~~~~
11:17:57 In file included from src/Main.cpp:6:
11:17:57 lib/NeoPixelBus/src/NeoPixelBrightnessBus.h:32:106: note: declared here
11:17:57 template<typename T_COLOR_FEATURE, typename T_METHOD> class [[deprecated("Use NeoPixelBusLg instead.")]] NeoPixelBrightnessBus :
11:17:57 ^~~~~~~~~~~~~~~~~~~~~
11:17:57 Compiling .pio\build\esp32-s3-devkitc-1\lib85c\NeoPixelBus\internal\colors\HtmlColorShortNames.cpp.o
11:17:57 Compiling .pio\build\esp32-s3-devkitc-1\lib85c\NeoPixelBus\internal\colors\NeoGammaDynamicTableMethod.cpp.o
11:17:57 Archiving .pio\build\esp32-s3-devkitc-1\lib9db\libDHT22.a
11:17:57 Archiving .pio\build\esp32-s3-devkitc-1\lib72c\libI2S.a
11:17:57 Archiving .pio\build\esp32-s3-devkitc-1\lib405\libEEPROM.a
11:17:57 Archiving .pio\build\esp32-s3-devkitc-1\lib2d1\libSPI.a
11:17:57 Archiving .pio\build\esp32-s3-devkitc-1\lib150\libCRC16.a
11:17:57 Compiling .pio\build\esp32-s3-devkitc-1\lib85c\NeoPixelBus\internal\colors\NeoGammaTableMethod.cpp.o
11:17:57 Compiling .pio\build\esp32-s3-devkitc-1\lib85c\NeoPixelBus\internal\colors\Rgb48Color.cpp.o
11:17:57 Compiling .pio\build\esp32-s3-devkitc-1\lib85c\NeoPixelBus\internal\colors\RgbColor.cpp.o
11:17:57 Compiling .pio\build\esp32-s3-devkitc-1\lib85c\NeoPixelBus\internal\colors\RgbColorBase.cpp.o
11:17:58 Compiling .pio\build\esp32-s3-devkitc-1\lib85c\NeoPixelBus\internal\colors\Rgbw64Color.cpp.o
11:17:58 Compiling .pio\build\esp32-s3-devkitc-1\lib85c\NeoPixelBus\internal\colors\RgbwColor.cpp.o
11:17:58 Compiling .pio\build\esp32-s3-devkitc-1\lib85c\NeoPixelBus\internal\colors\Rgbww80Color.cpp.o
11:17:58 Compiling .pio\build\esp32-s3-devkitc-1\lib85c\NeoPixelBus\internal\colors\RgbwwColor.cpp.o
11:17:58 Compiling .pio\build\esp32-s3-devkitc-1\lib85c\NeoPixelBus\internal\colors\RgbwwwColor.cpp.o
11:17:59 Compiling .pio\build\esp32-s3-devkitc-1\lib85c\NeoPixelBus\internal\colors\SegmentDigit.cpp.o
11:17:59 Compiling .pio\build\esp32-s3-devkitc-1\lib85c\NeoPixelBus\internal\methods\Esp32_i2s.c.o
11:17:59 Compiling .pio\build\esp32-s3-devkitc-1\lib85c\NeoPixelBus\internal\methods\FractionClk.c.o
11:17:59 Compiling .pio\build\esp32-s3-devkitc-1\lib85c\NeoPixelBus\internal\methods\NeoEsp32RmtMethod.cpp.o
11:17:59 Compiling .pio\build\esp32-s3-devkitc-1\lib85c\NeoPixelBus\internal\methods\NeoEsp8266I2sMethodCore.cpp.o
11:18:0 Compiling .pio\build\esp32-s3-devkitc-1\lib85c\NeoPixelBus\internal\methods\NeoEsp8266UartMethod.cpp.o
11:18:0 Compiling .pio\build\esp32-s3-devkitc-1\lib85c\NeoPixelBus\internal\methods\NeoEspBitBangMethod.cpp.o
11:18:0 Compiling .pio\build\esp32-s3-devkitc-1\lib85c\NeoPixelBus\internal\methods\NeoPixelAvr.c.o
11:18:0 Compiling .pio\build\esp32-s3-devkitc-1\lib85c\NeoPixelBus\internal\methods\Rp2040\NeoRp2040PioMonoProgram.cpp.o
11:18:1 Compiling .pio\build\esp32-s3-devkitc-1\lib77f\Wire\Wire.cpp.o
11:18:1 Compiling .pio\build\esp32-s3-devkitc-1\libc85\PCF8574 library\PCF8574.cpp.o
11:18:1 Compiling .pio\build\esp32-s3-devkitc-1\lib2d2\RTC\RtcDSC.cpp.o
11:18:1 Compiling .pio\build\esp32-s3-devkitc-1\lib2d2\RTC\RtcDateTime.cpp.o
11:18:2 Compiling .pio\build\esp32-s3-devkitc-1\lib2d2\RTC\RtcLocaleEn.cpp.o
11:18:2 Compiling .pio\build\esp32-s3-devkitc-1\lib2d2\RTC\RtcLocaleEnUs.cpp.o
11:18:2 Compiling .pio\build\esp32-s3-devkitc-1\lib2d2\RTC\RtcUtility.cpp.o
11:18:2 Compiling .pio\build\esp32-s3-devkitc-1\lib36d\EspSoftwareSerial\SoftwareSerial.cpp.o
11:18:2 Compiling .pio\build\esp32-s3-devkitc-1\lib3bf\Ticker\Ticker.cpp.o
11:18:3 Compiling .pio\build\esp32-s3-devkitc-1\libe21\WatchDog\WatchDog.cpp.o
11:18:3 Archiving .pio\build\esp32-s3-devkitc-1\lib85c\libNeoPixelBus.a
11:18:3 Compiling .pio\build\esp32-s3-devkitc-1\lib896\WiFi\WiFi.cpp.o
11:18:3 Archiving .pio\build\esp32-s3-devkitc-1\lib77f\libWire.a
11:18:3 Archiving .pio\build\esp32-s3-devkitc-1\lib3bf\libTicker.a
11:18:3 Compiling .pio\build\esp32-s3-devkitc-1\lib896\WiFi\WiFiAP.cpp.o
11:18:3 Compiling .pio\build\esp32-s3-devkitc-1\lib896\WiFi\WiFiClient.cpp.o
11:18:3 Archiving .pio\build\esp32-s3-devkitc-1\libc85\libPCF8574 library.a
11:18:3 Compiling .pio\build\esp32-s3-devkitc-1\lib896\WiFi\WiFiGeneric.cpp.o
11:18:3 Compiling .pio\build\esp32-s3-devkitc-1\lib896\WiFi\WiFiMulti.cpp.o
11:18:4 Compiling .pio\build\esp32-s3-devkitc-1\lib896\WiFi\WiFiSTA.cpp.o
11:18:4 Compiling .pio\build\esp32-s3-devkitc-1\lib896\WiFi\WiFiScan.cpp.o
11:18:4 Compiling .pio\build\esp32-s3-devkitc-1\lib896\WiFi\WiFiServer.cpp.o
11:18:4 Archiving .pio\build\esp32-s3-devkitc-1\lib2d2\libRTC.a
11:18:4 Compiling .pio\build\esp32-s3-devkitc-1\lib896\WiFi\WiFiUdp.cpp.o
11:18:4 Compiling .pio\build\esp32-s3-devkitc-1\FrameworkArduino\Esp.cpp.o
11:18:5 Archiving .pio\build\esp32-s3-devkitc-1\libe21\libWatchDog.a
11:18:5 Compiling .pio\build\esp32-s3-devkitc-1\FrameworkArduino\FirmwareMSC.cpp.o
11:18:5 Archiving .pio\build\esp32-s3-devkitc-1\lib36d\libEspSoftwareSerial.a
11:18:5 Compiling .pio\build\esp32-s3-devkitc-1\FrameworkArduino\FunctionalInterrupt.cpp.o
11:18:5 Compiling .pio\build\esp32-s3-devkitc-1\FrameworkArduino\HWCDC.cpp.o
11:18:6 Compiling .pio\build\esp32-s3-devkitc-1\FrameworkArduino\HardwareSerial.cpp.o
11:18:6 Compiling .pio\build\esp32-s3-devkitc-1\FrameworkArduino\IPAddress.cpp.o
11:18:6 Compiling .pio\build\esp32-s3-devkitc-1\FrameworkArduino\IPv6Address.cpp.o
11:18:6 Compiling .pio\build\esp32-s3-devkitc-1\FrameworkArduino\MD5Builder.cpp.o
11:18:6 Compiling .pio\build\esp32-s3-devkitc-1\FrameworkArduino\Print.cpp.o
11:18:6 Compiling .pio\build\esp32-s3-devkitc-1\FrameworkArduino\Stream.cpp.o
11:18:6 Compiling .pio\build\esp32-s3-devkitc-1\FrameworkArduino\StreamString.cpp.o
11:18:6 Compiling .pio\build\esp32-s3-devkitc-1\FrameworkArduino\Tone.cpp.o
11:18:7 Archiving .pio\build\esp32-s3-devkitc-1\lib896\libWiFi.a
11:18:7 Compiling .pio\build\esp32-s3-devkitc-1\FrameworkArduino\USB.cpp.o
11:18:7 Compiling .pio\build\esp32-s3-devkitc-1\FrameworkArduino\USBCDC.cpp.o
11:18:7 Compiling .pio\build\esp32-s3-devkitc-1\FrameworkArduino\USBMSC.cpp.o
11:18:7 Compiling .pio\build\esp32-s3-devkitc-1\FrameworkArduino\WMath.cpp.o
11:18:8 Compiling .pio\build\esp32-s3-devkitc-1\FrameworkArduino\WString.cpp.o
11:18:8 Compiling .pio\build\esp32-s3-devkitc-1\FrameworkArduino\base64.cpp.o
11:18:8 Compiling .pio\build\esp32-s3-devkitc-1\FrameworkArduino\cbuf.cpp.o
11:18:8 Compiling .pio\build\esp32-s3-devkitc-1\FrameworkArduino\esp32-hal-adc.c.o
11:18:8 Compiling .pio\build\esp32-s3-devkitc-1\FrameworkArduino\esp32-hal-bt.c.o
11:18:8 Compiling .pio\build\esp32-s3-devkitc-1\FrameworkArduino\esp32-hal-cpu.c.o
11:18:9 Compiling .pio\build\esp32-s3-devkitc-1\FrameworkArduino\esp32-hal-dac.c.o
11:18:9 Compiling .pio\build\esp32-s3-devkitc-1\FrameworkArduino\esp32-hal-gpio.c.o
11:18:9 Compiling .pio\build\esp32-s3-devkitc-1\FrameworkArduino\esp32-hal-i2c-slave.c.o
11:18:9 Compiling .pio\build\esp32-s3-devkitc-1\FrameworkArduino\esp32-hal-i2c.c.o
11:18:9 Compiling .pio\build\esp32-s3-devkitc-1\FrameworkArduino\esp32-hal-ledc.c.o
11:18:9 Compiling .pio\build\esp32-s3-devkitc-1\FrameworkArduino\esp32-hal-matrix.c.o
11:18:9 Compiling .pio\build\esp32-s3-devkitc-1\FrameworkArduino\esp32-hal-misc.c.o
11:18:9 Compiling .pio\build\esp32-s3-devkitc-1\FrameworkArduino\esp32-hal-psram.c.o
11:18:9 Compiling .pio\build\esp32-s3-devkitc-1\FrameworkArduino\esp32-hal-rgb-led.c.o
11:18:9 Compiling .pio\build\esp32-s3-devkitc-1\FrameworkArduino\esp32-hal-rmt.c.o
11:18:9 Compiling .pio\build\esp32-s3-devkitc-1\FrameworkArduino\esp32-hal-sigmadelta.c.o
11:18:10 Compiling .pio\build\esp32-s3-devkitc-1\FrameworkArduino\esp32-hal-spi.c.o
11:18:10 Compiling .pio\build\esp32-s3-devkitc-1\FrameworkArduino\esp32-hal-time.c.o
11:18:10 Compiling .pio\build\esp32-s3-devkitc-1\FrameworkArduino\esp32-hal-timer.c.o
11:18:10 Compiling .pio\build\esp32-s3-devkitc-1\FrameworkArduino\esp32-hal-tinyusb.c.o
11:18:10 Compiling .pio\build\esp32-s3-devkitc-1\FrameworkArduino\esp32-hal-touch.c.o
11:18:10 Compiling .pio\build\esp32-s3-devkitc-1\FrameworkArduino\esp32-hal-uart.c.o
11:18:10 Compiling .pio\build\esp32-s3-devkitc-1\FrameworkArduino\firmware_msc_fat.c.o
11:18:10 Compiling .pio\build\esp32-s3-devkitc-1\FrameworkArduino\libb64\cdecode.c.o
11:18:10 Compiling .pio\build\esp32-s3-devkitc-1\FrameworkArduino\libb64\cencode.c.o
11:18:10 Compiling .pio\build\esp32-s3-devkitc-1\FrameworkArduino\main.cpp.o
11:18:10 Compiling .pio\build\esp32-s3-devkitc-1\FrameworkArduino\stdlib_noniso.c.o
11:18:11 Compiling .pio\build\esp32-s3-devkitc-1\FrameworkArduino\wiring_pulse.c.o
11:18:11 Compiling .pio\build\esp32-s3-devkitc-1\FrameworkArduino\wiring_shift.c.o
11:18:12 Archiving .pio\build\esp32-s3-devkitc-1\libFrameworkArduino.a
11:18:12 Linking .pio\build\esp32-s3-devkitc-1\firmware.elf
11:18:13 c:/vcnstudio.4.7.0/tools/pio/packages/toolchain-xtensa-esp32s3/bin/../lib/gcc/xtensa-esp32s3-elf/8.4.0/../../../../xtensa-esp32s3-elf/bin/ld.exe: cannot find @C:\WINDOWS\TEMP\ccwlrn1D: Invalid argument
11:18:13 c:/vcnstudio.4.7.0/tools/pio/packages/toolchain-xtensa-esp32s3/bin/../lib/gcc/xtensa-esp32s3-elf/8.4.0/../../../../xtensa-esp32s3-elf/bin/ld.exe: c:/vcnstudio.4.7.0/tools/pio/packages/toolchain-xtensa-esp32s3/bin/../lib/gcc/xtensa-esp32s3-elf/8.4.0/../../../../xtensa-esp32s3-elf/lib/no-rtti\libc.a(lib_a-stdio.o):(.literal+0x20): warning: _close_r is not implemented and will always fail
11:18:13 c:/vcnstudio.4.7.0/tools/pio/packages/toolchain-xtensa-esp32s3/bin/../lib/gcc/xtensa-esp32s3-elf/8.4.0/../../../../xtensa-esp32s3-elf/bin/ld.exe: c:/vcnstudio.4.7.0/tools/pio/packages/toolchain-xtensa-esp32s3/bin/../lib/gcc/xtensa-esp32s3-elf/8.4.0/../../../../xtensa-esp32s3-elf/lib/no-rtti\libc.a(lib_a-makebuf.o):(.literal+0xc): warning: _fstat_r is not implemented and will always fail
11:18:13 c:/vcnstudio.4.7.0/tools/pio/packages/toolchain-xtensa-esp32s3/bin/../lib/gcc/xtensa-esp32s3-elf/8.4.0/../../../../xtensa-esp32s3-elf/bin/ld.exe: c:/vcnstudio.4.7.0/tools/pio/packages/toolchain-xtensa-esp32s3/bin/../lib/gcc/xtensa-esp32s3-elf/8.4.0/../../../../xtensa-esp32s3-elf/lib/no-rtti\libc.a(lib_a-raise.o):(.literal+0x0): warning: _getpid_r is not implemented and will always fail
11:18:13 c:/vcnstudio.4.7.0/tools/pio/packages/toolchain-xtensa-esp32s3/bin/../lib/gcc/xtensa-esp32s3-elf/8.4.0/../../../../xtensa-esp32s3-elf/bin/ld.exe: c:/vcnstudio.4.7.0/tools/pio/packages/toolchain-xtensa-esp32s3/bin/../lib/gcc/xtensa-esp32s3-elf/8.4.0/../../../../xtensa-esp32s3-elf/lib/no-rtti\libc.a(lib_a-raise.o):(.literal+0x4): warning: _kill_r is not implemented and will always fail
11:18:13 c:/vcnstudio.4.7.0/tools/pio/packages/toolchain-xtensa-esp32s3/bin/../lib/gcc/xtensa-esp32s3-elf/8.4.0/../../../../xtensa-esp32s3-elf/bin/ld.exe: c:/vcnstudio.4.7.0/tools/pio/packages/toolchain-xtensa-esp32s3/bin/../lib/gcc/xtensa-esp32s3-elf/8.4.0/../../../../xtensa-esp32s3-elf/lib/no-rtti\libc.a(lib_a-stdio.o):(.literal+0xc): warning: _lseek_r is not implemented and will always fail
11:18:13 c:/vcnstudio.4.7.0/tools/pio/packages/toolchain-xtensa-esp32s3/bin/../lib/gcc/xtensa-esp32s3-elf/8.4.0/../../../../xtensa-esp32s3-elf/bin/ld.exe: c:/vcnstudio.4.7.0/tools/pio/packages/toolchain-xtensa-esp32s3/bin/../lib/gcc/xtensa-esp32s3-elf/8.4.0/../../../../xtensa-esp32s3-elf/lib/no-rtti\libc.a(lib_a-stdio.o):(.literal+0x4): warning: _read_r is not implemented and will always fail
11:18:13 c:/vcnstudio.4.7.0/tools/pio/packages/toolchain-xtensa-esp32s3/bin/../lib/gcc/xtensa-esp32s3-elf/8.4.0/../../../../xtensa-esp32s3-elf/bin/ld.exe: c:/vcnstudio.4.7.0/tools/pio/packages/toolchain-xtensa-esp32s3/bin/../lib/gcc/xtensa-esp32s3-elf/8.4.0/../../../../xtensa-esp32s3-elf/lib/no-rtti\libc.a(lib_a-stdio.o):(.literal+0x10): warning: _write_r is not implemented and will always fail
11:18:13 c:/vcnstudio.4.7.0/tools/pio/packages/toolchain-xtensa-esp32s3/bin/../lib/gcc/xtensa-esp32s3-elf/8.4.0/../../../../xtensa-esp32s3-elf/bin/ld.exe: c:/vcnstudio.4.7.0/tools/pio/packages/toolchain-xtensa-esp32s3/bin/../lib/gcc/xtensa-esp32s3-elf/8.4.0/../../../../xtensa-esp32s3-elf/lib/no-rtti\libc.a(lib_a-vfiprintf.o):(.literal+0x54): warning: pthread_setcancelstate is not implemented and will always fail
11:18:13 c:/vcnstudio.4.7.0/tools/pio/packages/toolchain-xtensa-esp32s3/bin/../lib/gcc/xtensa-esp32s3-elf/8.4.0/../../../../xtensa-esp32s3-elf/bin/ld.exe: c:/vcnstudio.4.7.0/tools/pio/packages/toolchain-xtensa-esp32s3/bin/../lib/gcc/xtensa-esp32s3-elf/8.4.0/../../../../xtensa-esp32s3-elf/lib/no-rtti\libc.a(lib_a-assert.o):(.literal+0xc): warning: __getreent is not implemented and will always fail
11:18:13 collect2.exe: error: ld returned 1 exit status
11:18:13 *** [.pio\build\esp32-s3-devkitc-1\firmware.elf] Error 1
11:18:13 ========================= [FAILED] Took 24.17 seconds =========================
11:18:13 项目《66》编译成功;程序输出目录:C:\esp\_build
11:18:13 编译耗时:30.4510318秒
疑似C盘临时目录权限问题:
cannot find @C:\WINDOWS\TEMP\ccwlrn1D: Invalid argument
1.清理C盘临时目录文件,然后尝试以管理员方式运行 VcnStudo.exe 重新编译,看问题是否仍然存在。
2.确保您电脑中的管理员用户账户有足够的权限访问C:\WINDOWS\TEMP目录。你可以通过右键点击该目录,选择“属性”,然后在“安全”标签中检查权限设置。确保你的用户账户在“组或用户名”列表中,并且拥有“完全控制”权限。